Forums Neueste Beiträge
 

[gentoo-user-de] gcc will nicht gebaut werden

22/02/2008 - 14:00 von Sebastian | Report spam
Hallo,
beim Systemupdate bleibe ich immer hàngen beim emergen von gcc-4.2.3 mit
folgender Fehlermeldung.

/usr/i686-pc-linux-gnu/bin/ld: crt1.o: No such file: No such file or directory
collect2: ld returned 1 exit status
make[3]: *** [cc1-dummy] Fehler 1
make[3]: Leaving directory
`/var/tmp/portage/sys-devel/gcc-4.2.3/work/build/gcc'
make[2]: *** [all-stageprofile-gcc] Fehler 2
make[2]: Leaving directory `/var/tmp/portage/sys-devel/gcc-4.2.3/work/build'
make[1]: *** [stageprofile-bubble] Fehler 2
make[1]: Leaving directory `/var/tmp/portage/sys-devel/gcc-4.2.3/work/build'
make: *** [profiledbootstrap] Fehler 2
*
* ERROR: sys-devel/gcc-4.2.3 failed.
* Call stack:
* ebuild.sh, line 49: Called src_compile
* environment, line 4548: Called toolchain_src_compile
* environment, line 5017: Called gcc_src_compile
* environment, line 2907: Called gcc_do_make
* environment, line 2737: Called die
* The specific snippet of code:
* emake LDFLAGS="${LDFLAGS}" STAGE1_CFLAGS="${STAGE1_CFLAGS}"
LIBPATH="${LIBPATH}" BOOT_CFLAGS="${BOOT_CFLAGS}" ${GCC_MAKE_TARGET} ||
die "emake failed with ${GCC_MAKE_TARGET}";
* The die message:
* emake failed with profiledbootstrap

Der Link /usr/i686-pc-linux-gnu/bin/ld verweist
auf /usr/i686-pc-linux-gnu/binutils-bin/2.18/ld und ist soweit ich das sehe
vorhanden und ausführbar.
Was emerge mir mit den LDFLLAGS=.. etc sagen will, verstehe ich jetzt gar
nicht.

Bei Google habe ich jetzt auch nichts gefunden was mir weiterhilft.

Gruß
Sebastian
gentoo-user-de@lists.gentoo.org mailing list
 

Lesen sie die antworten

#1 Sebastian
22/02/2008 - 15:40 | Warnen spam
Am Freitag, 22. Februar 2008 schrieb Sebastian:
Hallo,
beim Systemupdate bleibe ich immer hàngen beim emergen von gcc-4.2.3 mit
folgender Fehlermeldung.

/usr/i686-pc-linux-gnu/bin/ld: crt1.o: No such file: No such file or
directory collect2: ld returned 1 exit status
make[3]: *** [cc1-dummy] Fehler 1
make[3]: Leaving directory
`/var/tmp/portage/sys-devel/gcc-4.2.3/work/build/gcc'
make[2]: *** [all-stageprofile-gcc] Fehler 2
make[2]: Leaving directory
`/var/tmp/portage/sys-devel/gcc-4.2.3/work/build' make[1]: ***
[stageprofile-bubble] Fehler 2
make[1]: Leaving directory
`/var/tmp/portage/sys-devel/gcc-4.2.3/work/build' make: ***
[profiledbootstrap] Fehler 2
*
* ERROR: sys-devel/gcc-4.2.3 failed.
* Call stack:
* ebuild.sh, line 49: Called src_compile
* environment, line 4548: Called toolchain_src_compile
* environment, line 5017: Called gcc_src_compile
* environment, line 2907: Called gcc_do_make
* environment, line 2737: Called die
* The specific snippet of code:
* emake LDFLAGS="${LDFLAGS}" STAGE1_CFLAGS="${STAGE1_CFLAGS}"
LIBPATH="${LIBPATH}" BOOT_CFLAGS="${BOOT_CFLAGS}" ${GCC_MAKE_TARGET} ||
die "emake failed with ${GCC_MAKE_TARGET}";
* The die message:
* emake failed with profiledbootstrap

Der Link /usr/i686-pc-linux-gnu/bin/ld verweist
auf /usr/i686-pc-linux-gnu/binutils-bin/2.18/ld und ist soweit ich das sehe
vorhanden und ausführbar.
Was emerge mir mit den LDFLLAGS=.. etc sagen will, verstehe ich jetzt gar
nicht.

Bei Google habe ich jetzt auch nichts gefunden was mir weiterhilft.



ich habe jetzt nochmal emerge gcc aufgerufen und da scheitert er jetzt schon
am configuren.

checking whether ln -s works... yes
checking for gcc... gcc
checking whether the C compiler (gcc -march=athlon -pipe -O2 ) works... no
configure: error: installation or configuration problem: C compiler cannot
create executables.
*
* ERROR: sys-devel/gcc-4.2.3 failed.
* Call stack:
* ebuild.sh, line 49: Called src_compile
* environment, line 4548: Called toolchain_src_compile
* environment, line 5017: Called gcc_src_compile
* environment, line 2903: Called gcc_do_configure
* environment, line 2669: Called die
* The specific snippet of code:
* "${S}"/configure ${confgcc} $@ ${EXTRA_ECONF} || die "failed to run
configure";
* The die message:
* failed to run configure

Gruß
Sebastian
mailing list

Ähnliche fragen